donor_id,tumor_name,molecular_subtype,extent_of_resection,surgery,mgmt_methylation,survival_days,egfr_amplification,initial_kps,age_in_years,sub_block_id,sub_block_name,study_name,specimen_page_link,data_set_id,normalized_area_le,normalized_area_lehbv,normalized_area_it,normalized_area_ithbv,normalized_area_ct,normalized_area_ctpnz,normalized_area_ctpnn,normalized_area_ctpan,normalized_area_cthbv,normalized_area_ctmvp,normalized_area_ctne
12111,W10-1-1,Proneural,Complete,primary,Yes,,No,100,44 yrs,287469100,W10-1-1-B.2.01,Cancer Stem Cells ISH Survey,http://glioblastoma.alleninstitute.org/ish/specimen/show/287469100,292327632,0.0298202,,0.0543815,9.37329e-05,0.487165,0.0461125,,,0.174415,,0.208012
12111,W10-1-1,Proneural,Complete,primary,Yes,,No,100,44 yrs,287469103,W10-1-1-B.2.02,Cancer Stem Cells ISH Survey,http://glioblastoma.alleninstitute.org/ish/specimen/show/287469103,292327321,0.0501625,,0.107722,0.000253089,0.497194,0.0600926,,,0.179684,,0.104891
12111,W10-1-1,Proneural,Complete,primary,Yes,,No,100,44 yrs,287533341,W10-1-1-C.1.01,Cancer Stem Cells ISH Survey,http://glioblastoma.alleninstitute.org/ish/specimen/show/287533341,292327337,0.501572,,0.283193,,0.206,,0.00923493,,,,
12111,W10-1-1,Proneural,Complete,primary,Yes,,No,100,44 yrs,287469107,W10-1-1-C.2.01,Cancer Stem Cells ISH Survey,http://glioblastoma.alleninstitute.org/ish/specimen/show/287469107,292327628,0.651913,,0.33423,,0.0138576,,,,,,
12111,W10-1-1,Proneural,Complete,primary,Yes,,No,100,44 yrs,287469111,W10-1-1-C.2.02,Cancer Stem Cells ISH Survey,http://glioblastoma.alleninstitute.org/ish/specimen/show/287469111,292327317,0.692834,,0.289671,,0.0174952,,,,,,
12111,W10-1-1,Proneural,Complete,primary,Yes,,No,100,44 yrs,287469118,W10-1-1-D.1.01,Cancer Stem Cells ISH Survey,http://glioblastoma.alleninstitute.org/ish/specimen/show/287469118,292327640,0.308829,0.00019048,0.242587,0.000948191,0.180528,0.0467161,,,0.0229302,,0.197271
12111,W10-1-1,Proneural,Complete,primary,Yes,,No,100,44 yrs,287469323,W10-1-1-D.1.02,Cancer Stem Cells ISH Survey,http://glioblastoma.alleninstitute.org/ish/specimen/show/287469323,292327329,0.318456,3.92812e-05,0.288036,0.00065951,0.210078,0.0303106,,,0.0134021,,0.139018
12111,W10-1-1,Proneural,Complete,primary,Yes,,No,100,44 yrs,706688,W10-1-1-D.2.01,Anatomic Structures ISH Survey,http://glioblastoma.alleninstitute.org/ish/specimen/show/706688,100125328,0.169696,0.00278012,,,0.181064,0.0218986,,0.0219823,0.20519,,0.397389
12111,W10-1-1,Proneural,Complete,primary,Yes,,No,100,44 yrs,706689,W10-1-1-D.2.02,Anatomic Structures ISH Survey,http://glioblastoma.alleninstitute.org/ish/specimen/show/706689,100125360,0.21935,0.00211652,,,0.227181,0.0186732,4.52973e-06,0.0357577,0.181922,,0.314996
12111,W10-1-1,Proneural,Complete,primary,Yes,,No,100,44 yrs,706690,W10-1-1-D.2.03,Anatomic Structures ISH Survey,http://glioblastoma.alleninstitute.org/ish/specimen/show/706690,100125323,0.238418,0.00234902,,,0.172607,0.0227398,,0.0290699,0.178253,,0.356563
12111,W10-1-1,Proneural,Complete,primary,Yes,,No,100,44 yrs,706691,W10-1-1-D.2.04,Anatomic Structures ISH Survey,http://glioblastoma.alleninstitute.org/ish/specimen/show/706691,100125347,0.227395,0.00501497,,,0.122147,0.0279641,,0.0717669,0.160943,,0.384768
12111,W10-1-1,Proneural,Complete,primary,Yes,,No,100,44 yrs,706692,W10-1-1-D.2.05,Anatomic Structures ISH Survey,http://glioblastoma.alleninstitute.org/ish/specimen/show/706692,100125353,0.206918,0.00886961,,,0.088143,0.0375245,,0.0921149,0.174045,,0.392384
12111,W10-1-1,Proneural,Complete,primary,Yes,,No,100,44 yrs,706693,W10-1-1-D.2.06,Anatomic Structures ISH Survey,http://glioblastoma.alleninstitute.org/ish/specimen/show/706693,100125337,0.229217,0.00718584,,,0.0802829,0.0265497,,0.138015,0.15684,,0.36191
12111,W10-1-1,Proneural,Complete,primary,Yes,,No,100,44 yrs,706694,W10-1-1-D.2.07,Anatomic Structures ISH Survey,http://glioblastoma.alleninstitute.org/ish/specimen/show/706694,100125370,0.00543695,0.00442531,,,0.0347939,0.0110875,,0.194739,0.0464226,,0.703094
12111,W10-1-1,Proneural,Complete,primary,Yes,,No,100,44 yrs,706695,W10-1-1-D.2.08,Anatomic Structures ISH Survey,http://glioblastoma.alleninstitute.org/ish/specimen/show/706695,100125378,0.0203505,0.0253979,,,0.059811,0.0207061,,0.128128,0.0866332,,0.658974
12111,W10-1-1,Proneural,Complete,primary,Yes,,No,100,44 yrs,287469387,W10-1-1-E.2.01,Cancer Stem Cells ISH Survey,http://glioblastoma.alleninstitute.org/ish/specimen/show/287469387,292327636,0.297514,1.76565e-05,0.193887,0.00142429,0.151261,0.106696,,,0.0993865,,0.149813
12111,W10-1-1,Proneural,Complete,primary,Yes,,No,100,44 yrs,287469390,W10-1-1-E.2.02,Cancer Stem Cells ISH Survey,http://glioblastoma.alleninstitute.org/ish/specimen/show/287469390,292327325,0.311878,5.61879e-06,0.142387,0.000748236,0.175525,0.128965,,,0.0986323,,0.14186
12111,W10-1-1,Proneural,Complete,primary,Yes,,No,100,44 yrs,301589924,W10-1-1-E.2.03,Cancer Stem Cells RNA Seq,http://glioblastoma.alleninstitute.org/ish/specimen/show/301589924,302049403,0.324235,,,,0.376156,0.0718449,,,,,0.227764
12111,W10-1-1,Proneural,Complete,primary,Yes,,No,100,44 yrs,706936,W10-1-1-F.1.01,Anatomic Structures ISH Survey,http://glioblastoma.alleninstitute.org/ish/specimen/show/706936,100125385,0.00332493,0.00358556,,,0.185826,0.0451773,,0.00472283,0.407136,,0.350228
12111,W10-1-1,Proneural,Complete,primary,Yes,,No,100,44 yrs,706937,W10-1-1-F.1.02,Anatomic Structures ISH Survey,http://glioblastoma.alleninstitute.org/ish/specimen/show/706937,100125393,,,,,0.184893,0.0410336,,,0.453225,,0.320848
12111,W10-1-1,Proneural,Complete,primary,Yes,,No,100,44 yrs,706938,W10-1-1-F.1.03,Anatomic Structures ISH Survey,http://glioblastoma.alleninstitute.org/ish/specimen/show/706938,100125404,,,,,0.106894,0.0321866,,,0.517879,,0.343041
12111,W10-1-1,Proneural,Complete,primary,Yes,,No,100,44 yrs,706939,W10-1-1-F.1.04,Anatomic Structures ISH Survey,http://glioblastoma.alleninstitute.org/ish/specimen/show/706939,100125412,,,,,0.0739907,0.0320193,,,0.460677,,0.433313
12111,W10-1-1,Proneural,Complete,primary,Yes,,No,100,44 yrs,706940,W10-1-1-F.1.05,Cancer Stem Cells ISH Survey,http://glioblastoma.alleninstitute.org/ish/specimen/show/706940,292327648,0.16078,,0.260449,,0.399455,0.0471978,,0.00764334,,0.021155,0.10332
12111,W10-1-1,Proneural,Complete,primary,Yes,,No,100,44 yrs,287496458,W10-1-1-G.2.01,Cancer Stem Cells ISH Survey,http://glioblastoma.alleninstitute.org/ish/specimen/show/287496458,292327644,,,,,0.326163,0.175215,,0.013836,0.0441572,,0.440629
12111,W10-1-1,Proneural,Complete,primary,Yes,,No,100,44 yrs,287496465,W10-1-1-G.2.02,Cancer Stem Cells ISH Survey,http://glioblastoma.alleninstitute.org/ish/specimen/show/287496465,292327333,,,,,0.214752,0.196226,4.32673e-05,0.017824,0.0546192,,0.516536
12111,W10-1-1,Proneural,Complete,primary,Yes,,No,100,44 yrs,310607296,W10-1-1-G.2.03,Cancer Stem Cells ISH for Enriched Genes,http://glioblastoma.alleninstitute.org/ish/specimen/show/310607296,311174529,,,,,0.324733,0.21563,,,,,0.459637
12111,W10-1-1,Proneural,Complete,primary,Yes,,No,100,44 yrs,706836,W10-1-1-I.2.01,Cancer Stem Cells ISH Survey,http://glioblastoma.alleninstitute.org/ish/specimen/show/706836,292327656,0.0139398,0.000418427,0.0534367,6.3398e-06,0.506085,0.110898,,,0.0303965,,0.28482
12111,W10-1-1,Proneural,Complete,primary,Yes,,No,100,44 yrs,706837,W10-1-1-I.2.02,Cancer Stem Cells ISH Survey,http://glioblastoma.alleninstitute.org/ish/specimen/show/706837,292327345,0.0440695,0.00287888,0.0925589,0.000304558,0.397106,0.106229,,,0.0512276,,0.305626
12111,W10-1-1,Proneural,Complete,primary,Yes,,No,100,44 yrs,706838,W10-1-1-I.2.03,Cancer Stem Cells RNA Seq,http://glioblastoma.alleninstitute.org/ish/specimen/show/706838,302048999,0.00211203,,0.0861397,,0.392454,0.163185,,,,,0.356109
12111,W10-1-1,Proneural,Complete,primary,Yes,,No,100,44 yrs,308911123,W10-1-1-J.1.01,Anatomic Structures ISH for Enriched Genes,http://glioblastoma.alleninstitute.org/ish/specimen/show/308911123,310061011,,,0.309438,,0.500104,0.0494134,6.64702e-05,0.0342713,,,0.106706
12111,W10-1-1,Proneural,Complete,primary,Yes,,No,100,44 yrs,287497194,W10-1-1-J.2.01,Cancer Stem Cells ISH Survey,http://glioblastoma.alleninstitute.org/ish/specimen/show/287497194,292327652,0.544128,,0.244408,0.000546016,0.175521,0.00139771,0.00434013,0.0176008,0.00903337,,0.00302487
12111,W10-1-1,Proneural,Complete,primary,Yes,,No,100,44 yrs,287497197,W10-1-1-J.2.02,Cancer Stem Cells ISH Survey,http://glioblastoma.alleninstitute.org/ish/specimen/show/287497197,292327341,0.465568,,0.208343,0.000157559,0.267495,0.0020557,0.00304118,0.030912,0.0188298,,0.00359784
12111,W10-1-1,Proneural,Complete,primary,Yes,,No,100,44 yrs,308902453,W10-1-1-J.2.03,Anatomic Structures ISH for Enriched Genes,http://glioblastoma.alleninstitute.org/ish/specimen/show/308902453,310060759,0.438959,,0.0806773,0.000266696,0.366406,0.0377003,0.000945817,0.0220529,0.0233863,,0.0296051
12112,W11-1-1,"Classical, Mesenchymal",Complete,primary,Yes,1076,No,100,57 yrs,298129058,W11-1-1-B.1.01,Anatomic Structures RNA Seq,http://glioblastoma.alleninstitute.org/ish/specimen/show/298129058,298768434,0.136787,,0.146503,,0.172358,0.0361563,0.00367409,0.0574215,,,0.4471
12112,W11-1-1,"Classical, Mesenchymal",Complete,primary,Yes,1076,No,100,57 yrs,298129069,W11-1-1-B.1.02,Anatomic Structures ISH for Enriched Genes,http://glioblastoma.alleninstitute.org/ish/specimen/show/298129069,310443100,0.161362,2.46333e-05,0.15205,0.00116216,0.296769,0.0325748,0.00263224,0.0257822,0.019733,,0.307909
12112,W11-1-1,"Classical, Mesenchymal",Complete,primary,Yes,1076,No,100,57 yrs,310188994,W11-1-1-B.1.03,Cancer Stem Cells ISH for Enriched Genes,http://glioblastoma.alleninstitute.org/ish/specimen/show/310188994,310787337,,,0.357553,,0.340106,0.0455841,0.0060856,0.0495466,,,0.201126
12112,W11-1-1,"Classical, Mesenchymal",Complete,primary,Yes,1076,No,100,57 yrs,298129085,W11-1-1-C.1.01,Anatomic Structures RNA Seq,http://glioblastoma.alleninstitute.org/ish/specimen/show/298129085,298768360,0.0131197,,0.162088,,0.565508,0.0354645,0.00167813,0.0462167,,0.0134912,0.162434
12112,W11-1-1,"Classical, Mesenchymal",Complete,primary,Yes,1076,No,100,57 yrs,298129094,W11-1-1-C.1.02,Anatomic Structures ISH for Enriched Genes,http://glioblastoma.alleninstitute.org/ish/specimen/show/298129094,310443096,,,0.198674,,0.613258,0.0315476,0.000190951,0.0402697,0.00500377,,0.111057
12112,W11-1-1,"Classical, Mesenchymal",Complete,primary,Yes,1076,No,100,57 yrs,298129843,W11-1-1-D.1.01,Anatomic Structures RNA Seq,http://glioblastoma.alleninstitute.org/ish/specimen/show/298129843,298768533,,,,,0.358784,0.041059,0.000295982,0.0641311,,0.0107668,0.524964
12112,W11-1-1,"Classical, Mesenchymal",Complete,primary,Yes,1076,No,100,57 yrs,298129862,W11-1-1-D.1.02,Anatomic Structures ISH for Enriched Genes,http://glioblastoma.alleninstitute.org/ish/specimen/show/298129862,309714641,,,,,0.496951,0.0407927,0.0039352,0.0467059,0.00869394,,0.402921
12112,W11-1-1,"Classical, Mesenchymal",Complete,primary,Yes,1076,No,100,57 yrs,310008780,W11-1-1-D.1.03,Cancer Stem Cells ISH for Enriched Genes,http://glioblastoma.alleninstitute.org/ish/specimen/show/310008780,310787884,,,,,0.522945,0.0212722,0.00729944,0.0758632,0.0100104,,0.362609
12112,W11-1-1,"Classical, Mesenchymal",Complete,primary,Yes,1076,No,100,57 yrs,706698,W11-1-1-E.1.01,Anatomic Structures ISH Survey,http://glioblastoma.alleninstitute.org/ish/specimen/show/706698,100125333,0.0704081,6.09416e-06,0.0486253,,0.485389,0.0642059,0.000171191,0.059602,0.00926922,0.0658192,0.196504
12112,W11-1-1,"Classical, Mesenchymal",Complete,primary,Yes,1076,No,100,57 yrs,706699,W11-1-1-E.1.02,Anatomic Structures ISH Survey,http://glioblastoma.alleninstitute.org/ish/specimen/show/706699,100125365,0.138925,2.35837e-06,0.0755844,,0.334804,0.0973439,4.89361e-05,0.0540962,0.0101463,0.0300055,0.259044
12112,W11-1-1,"Classical, Mesenchymal",Complete,primary,Yes,1076,No,100,57 yrs,706700,W11-1-1-E.1.03,Anatomic Structures ISH Survey,http://glioblastoma.alleninstitute.org/ish/specimen/show/706700,100125320,0.264399,1.12262e-05,0.0800502,,0.23159,0.0881354,1.35897e-05,0.04352,0.00886459,0.0154674,0.267949
12112,W11-1-1,"Classical, Mesenchymal",Complete,primary,Yes,1076,No,100,57 yrs,706701,W11-1-1-E.1.04,Anatomic Structures ISH Survey,http://glioblastoma.alleninstitute.org/ish/specimen/show/706701,100125344,0.271989,1.06262e-05,0.122883,,0.190989,0.0838717,2.75032e-05,0.0420568,0.00734336,0.0104937,0.270335
12112,W11-1-1,"Classical, Mesenchymal",Complete,primary,Yes,1076,No,100,57 yrs,706702,W11-1-1-E.1.05,Anatomic Structures ISH Survey,http://glioblastoma.alleninstitute.org/ish/specimen/show/706702,100125355,0.564856,6.82289e-06,0.0535995,,0.0846425,0.0394255,,0.0261971,0.00231865,0.00115819,0.227796
12112,W11-1-1,"Classical, Mesenchymal",Complete,primary,Yes,1076,No,100,57 yrs,287637371,W11-1-1-E.2.01,Cancer Stem Cells ISH Survey,http://glioblastoma.alleninstitute.org/ish/specimen/show/287637371,292344472,,,,,0.168323,0.0285492,1.36239e-05,0.0204602,0.00820804,,0.774446
12112,W11-1-1,"Classical, Mesenchymal",Complete,primary,Yes,1076,No,100,57 yrs,287637375,W11-1-1-E.2.02,Cancer Stem Cells ISH Survey,http://glioblastoma.alleninstitute.org/ish/specimen/show/287637375,292344161,,,,,0.185619,0.0333304,0.00167934,0.0192599,0.00762617,,0.752486
12112,W11-1-1,"Classical, Mesenchymal",Complete,primary,Yes,1076,No,100,57 yrs,299863542,W11-1-1-E.2.03,Cancer Stem Cells RNA Seq,http://glioblastoma.alleninstitute.org/ish/specimen/show/299863542,300630250,,,,,0.225211,0.0218745,0.000562962,0.0137102,,,0.738642
12112,W11-1-1,"Classical, Mesenchymal",Complete,primary,Yes,1076,No,100,57 yrs,298129913,W11-1-1-F.1.01,Anatomic Structures RNA Seq,http://glioblastoma.alleninstitute.org/ish/specimen/show/298129913,298768667,0.412028,,0.112513,9.81835e-05,0.462189,,,,0.0131715,,
12112,W11-1-1,"Classical, Mesenchymal",Complete,primary,Yes,1076,No,100,57 yrs,298129924,W11-1-1-F.1.02,Anatomic Structures ISH for Enriched Genes,http://glioblastoma.alleninstitute.org/ish/specimen/show/298129924,309715088,0.401435,,0.150411,,0.448154,,,,,,
12112,W11-1-1,"Classical, Mesenchymal",Complete,primary,Yes,1076,No,100,57 yrs,706853,W11-1-1-G.1.01,Anatomic Structures ISH Survey,http://glioblastoma.alleninstitute.org/ish/specimen/show/706853,100125339,,,0.10268,,0.529146,0.0964652,,,,0.00397013,0.267738
12112,W11-1-1,"Classical, Mesenchymal",Complete,primary,Yes,1076,No,100,57 yrs,706854,W11-1-1-G.1.02,Anatomic Structures ISH Survey,http://glioblastoma.alleninstitute.org/ish/specimen/show/706854,100125369,,,0.0147829,,0.60983,0.0527691,,,,0.0821891,0.240429
12112,W11-1-1,"Classical, Mesenchymal",Complete,primary,Yes,1076,No,100,57 yrs,706855,W11-1-1-G.1.03,Anatomic Structures ISH Survey,http://glioblastoma.alleninstitute.org/ish/specimen/show/706855,100125377,,,0.0496317,,0.605099,0.046787,,,,0.0782467,0.220235
12112,W11-1-1,"Classical, Mesenchymal",Complete,primary,Yes,1076,No,100,57 yrs,706856,W11-1-1-G.1.04,Anatomic Structures ISH Survey,http://glioblastoma.alleninstitute.org/ish/specimen/show/706856,100125388,,,0.100339,,0.639519,0.0767208,,,,0.0908203,0.0926011
12112,W11-1-1,"Classical, Mesenchymal",Complete,primary,Yes,1076,No,100,57 yrs,706857,W11-1-1-G.1.05,Anatomic Structures ISH Survey,http://glioblastoma.alleninstitute.org/ish/specimen/show/706857,100125396,,,0.139702,,0.681882,0.0541586,,,,0.0796501,0.0446069
12112,W11-1-1,"Classical, Mesenchymal",Complete,primary,Yes,1076,No,100,57 yrs,706858,W11-1-1-G.1.06,Anatomic Structures ISH Survey,http://glioblastoma.alleninstitute.org/ish/specimen/show/706858,100125398,,,0.163977,,0.47806,0.0383809,,,,0.225696,0.0938867
12112,W11-1-1,"Classical, Mesenchymal",Complete,primary,Yes,1076,No,100,57 yrs,706859,W11-1-1-G.1.07,Anatomic Structures ISH Survey,http://glioblastoma.alleninstitute.org/ish/specimen/show/706859,100125406,,,0.222879,,0.405456,0.0318861,,,,0.211934,0.127844
12112,W11-1-1,"Classical, Mesenchymal",Complete,primary,Yes,1076,No,100,57 yrs,298130238,W11-1-1-G.2.01,Anatomic Structures RNA Seq,http://glioblastoma.alleninstitute.org/ish/specimen/show/298130238,298768485,,,,,0.464412,0.0733891,,,,0.00903319,0.453165
12112,W11-1-1,"Classical, Mesenchymal",Complete,primary,Yes,1076,No,100,57 yrs,298130505,W11-1-1-G.2.02,Anatomic Structures ISH for Enriched Genes,http://glioblastoma.alleninstitute.org/ish/specimen/show/298130505,310443108,,,,,0.437489,0.0884614,,,,,0.474049
12112,W11-1-1,"Classical, Mesenchymal",Complete,primary,Yes,1076,No,100,57 yrs,310361045,W11-1-1-G.2.03,Cancer Stem Cells ISH for Enriched Genes,http://glioblastoma.alleninstitute.org/ish/specimen/show/310361045,311175814,,,,,0.507808,0.0673131,0.0237169,0.020023,,,0.381139
12112,W11-1-1,"Classical, Mesenchymal",Complete,primary,Yes,1076,No,100,57 yrs,287637391,W11-1-1-H.1.01,Cancer Stem Cells ISH Survey,http://glioblastoma.alleninstitute.org/ish/specimen/show/287637391,292343829,,,,,0.171027,0.123643,,,0.0218273,,0.683503
12112,W11-1-1,"Classical, Mesenchymal",Complete,primary,Yes,1076,No,100,57 yrs,287637407,W11-1-1-H.1.02,Cancer Stem Cells ISH Survey,http://glioblastoma.alleninstitute.org/ish/specimen/show/287637407,292343518,,,,,0.175774,0.116108,,,0.0183622,,0.689756
12112,W11-1-1,"Classical, Mesenchymal",Complete,primary,Yes,1076,No,100,57 yrs,287637415,W11-1-1-L.2.01,Cancer Stem Cells ISH Survey,http://glioblastoma.alleninstitute.org/ish/specimen/show/287637415,292343825,,,,,0.467306,0.133852,0.00147424,0.132174,0.010231,,0.254963
12112,W11-1-1,"Classical, Mesenchymal",Complete,primary,Yes,1076,No,100,57 yrs,287637418,W11-1-1-L.2.02,Cancer Stem Cells ISH Survey,http://glioblastoma.alleninstitute.org/ish/specimen/show/287637418,292343514,,,,,0.361361,0.143077,0.00103531,0.0953865,0.00506472,,0.394075
12112,W11-1-1,"Classical, Mesenchymal",Complete,primary,Yes,1076,No,100,57 yrs,298130884,W11-1-1-M.1.01,Anatomic Structures RNA Seq,http://glioblastoma.alleninstitute.org/ish/specimen/show/298130884,298768607,,,,,0.48183,0.0599574,,,,0.0412648,0.416948
12112,W11-1-1,"Classical, Mesenchymal",Complete,primary,Yes,1076,No,100,57 yrs,298130888,W11-1-1-M.1.02,Anatomic Structures ISH for Enriched Genes,http://glioblastoma.alleninstitute.org/ish/specimen/show/298130888,310443104,,,,,0.399464,0.0802119,0.000630923,0.0352567,0.027932,,0.456505
10865,W1-1-2,Classical,Complete,primary,No,105,Yes,100,66 yrs,285041108,W1-1-2-A.1.01,Cancer Stem Cells ISH Survey,http://glioblastoma.alleninstitute.org/ish/specimen/show/285041108,292324206,0.387362,,0.612638,,,,,,,,
10865,W1-1-2,Classical,Complete,primary,No,105,Yes,100,66 yrs,285041111,W1-1-2-A.1.02,Cancer Stem Cells ISH Survey,http://glioblastoma.alleninstitute.org/ish/specimen/show/285041111,292324517,0.345923,,0.654077,,,,,,,,
10865,W1-1-2,Classical,Complete,primary,No,105,Yes,100,66 yrs,264712561,W1-1-2-AB.2.01,Cancer Stem Cells ISH Survey,http://glioblastoma.alleninstitute.org/ish/specimen/show/264712561,266291544,0.162816,,0.184961,,0.369461,0.0424597,,,,,0.240303
10865,W1-1-2,Classical,Complete,primary,No,105,Yes,100,66 yrs,264712748,W1-1-2-AB.2.02,Cancer Stem Cells ISH Survey,http://glioblastoma.alleninstitute.org/ish/specimen/show/264712748,266291231,0.158773,,0.212753,,0.370837,0.0407661,,,,,0.216871
10865,W1-1-2,Classical,Complete,primary,No,105,Yes,100,66 yrs,264712751,W1-1-2-AB.2.03,Cancer Stem Cells ISH Survey,http://glioblastoma.alleninstitute.org/ish/specimen/show/264712751,266290920,0.142459,,0.255635,,0.367935,0.0493467,,,,,0.184624
10865,W1-1-2,Classical,Complete,primary,No,105,Yes,100,66 yrs,285041631,W1-1-2-AB.2.04,Cancer Stem Cells ISH Survey,http://glioblastoma.alleninstitute.org/ish/specimen/show/285041631,292324226,0.132332,,0.377749,,0.315727,0.0481272,,,,,0.126066
10865,W1-1-2,Classical,Complete,primary,No,105,Yes,100,66 yrs,285041667,W1-1-2-AB.2.05,Cancer Stem Cells ISH Survey,http://glioblastoma.alleninstitute.org/ish/specimen/show/285041667,292324537,0.160454,,0.394294,,0.333171,0.0392504,,,,,0.0728315
10865,W1-1-2,Classical,Complete,primary,No,105,Yes,100,66 yrs,285041115,W1-1-2-B.1.01,Cancer Stem Cells ISH Survey,http://glioblastoma.alleninstitute.org/ish/specimen/show/285041115,292324202,0.487509,,0.512491,,,,,,,,
10865,W1-1-2,Classical,Complete,primary,No,105,Yes,100,66 yrs,285041119,W1-1-2-B.1.02,Cancer Stem Cells ISH Survey,http://glioblastoma.alleninstitute.org/ish/specimen/show/285041119,292324513,0.426225,,0.573775,,,,,,,,
10865,W1-1-2,Classical,Complete,primary,No,105,Yes,100,66 yrs,297710593,W1-1-2-D.2.01,Anatomic Structures RNA Seq,http://glioblastoma.alleninstitute.org/ish/specimen/show/297710593,298107475,0.314674,,0.379643,,0.235512,0.00751781,,,,0.0133325,0.0493202
10865,W1-1-2,Classical,Complete,primary,No,105,Yes,100,66 yrs,285041123,W1-1-2-E.1.01,Cancer Stem Cells ISH Survey,http://glioblastoma.alleninstitute.org/ish/specimen/show/285041123,292324214,0.413434,0.000503799,0.396829,0.00250321,0.140471,0.00611627,,,0.00673662,,0.0334056
10865,W1-1-2,Classical,Complete,primary,No,105,Yes,100,66 yrs,285041129,W1-1-2-E.1.02,Cancer Stem Cells ISH Survey,http://glioblastoma.alleninstitute.org/ish/specimen/show/285041129,292324525,0.35254,0.000876402,0.399408,0.0024687,0.163739,0.0140068,,,0.013516,,0.0534449
10865,W1-1-2,Classical,Complete,primary,No,105,Yes,100,66 yrs,300113644,W1-1-2-E.1.03,Cancer Stem Cells RNA Seq,http://glioblastoma.alleninstitute.org/ish/specimen/show/300113644,300631479,0.271983,,0.343263,,0.280037,0.0269292,,,,,0.0777874
10865,W1-1-2,Classical,Complete,primary,No,105,Yes,100,66 yrs,297710624,W1-1-2-H.2.01,Anatomic Structures RNA Seq,http://glioblastoma.alleninstitute.org/ish/specimen/show/297710624,298107625,0.325738,,0.35645,,0.25296,0.00151674,0.000672583,0.014729,,0.00951728,0.0384162
10865,W1-1-2,Classical,Complete,primary,No,105,Yes,100,66 yrs,308886280,W1-1-2-H.2.02,Anatomic Structures ISH for Enriched Genes,http://glioblastoma.alleninstitute.org/ish/specimen/show/308886280,309715092,0.321435,,0.0548172,1.74724e-06,0.500754,0.00462845,0.00336694,0.0254801,0.0122185,,0.0772981
10865,W1-1-2,Classical,Complete,primary,No,105,Yes,100,66 yrs,310361088,W1-1-2-H.2.03,Cancer Stem Cells ISH for Enriched Genes,http://glioblastoma.alleninstitute.org/ish/specimen/show/310361088,311175842,,,0.401088,,0.457026,0.0118933,0.00220372,0.0260384,0.0130145,,0.0887355
10865,W1-1-2,Classical,Complete,primary,No,105,Yes,100,66 yrs,706600,W1-1-2-K.1.01,Anatomic Structures ISH Survey,http://glioblastoma.alleninstitute.org/ish/specimen/show/706600,100125330,,,0.0903869,9.85988e-06,0.685014,0.0830075,0.00254807,0.0354751,0.0416052,,0.0619531
10865,W1-1-2,Classical,Complete,primary,No,105,Yes,100,66 yrs,706601,W1-1-2-K.1.02,Anatomic Structures ISH Survey,http://glioblastoma.alleninstitute.org/ish/specimen/show/706601,100125362,,,0.0501111,1.90172e-05,0.603056,0.071586,0.00859945,0.0954943,0.07142,,0.0997139
10865,W1-1-2,Classical,Complete,primary,No,105,Yes,100,66 yrs,706602,W1-1-2-K.1.03,Anatomic Structures ISH Survey,http://glioblastoma.alleninstitute.org/ish/specimen/show/706602,100125321,,,0.0619623,,0.56346,0.0826341,0.00713881,0.0843437,0.064007,,0.136454
10865,W1-1-2,Classical,Complete,primary,No,105,Yes,100,66 yrs,706603,W1-1-2-K.1.04,Anatomic Structures ISH Survey,http://glioblastoma.alleninstitute.org/ish/specimen/show/706603,100125345,,,0.0631738,,0.501854,0.0762394,0.00809143,0.0884977,0.0440918,,0.218052
10865,W1-1-2,Classical,Complete,primary,No,105,Yes,100,66 yrs,706604,W1-1-2-K.1.05,Anatomic Structures ISH Survey,http://glioblastoma.alleninstitute.org/ish/specimen/show/706604,100125356,,,0.103073,6.45949e-07,0.375104,0.0870707,0.00280471,0.0961308,0.0373527,,0.298463
10865,W1-1-2,Classical,Complete,primary,No,105,Yes,100,66 yrs,264713700,W1-1-2-K.2.01,Cancer Stem Cells ISH Survey,http://glioblastoma.alleninstitute.org/ish/specimen/show/264713700,266290608,,,0.633796,0.001594,0.244976,0.0184204,0.00028447,0.00138045,0.0142396,,0.0853088